Target
Protein farnesyltransferase subunit beta/geranylgeranyltransferase type-1 subunit alpha
Ligand
BDBM50126335
Substrate
Meas. Tech.
ChEMBL_69849 (CHEMBL680439)
IC50
0.570000±n/a nM
Citation
 Curtin, MLFlorjancic, ASCohen, JGu, WZFrost, DJMuchmore, SWSham, HL Novel and selective imidazole-containing biphenyl inhibitors of protein farnesyltransferase. Bioorg Med Chem Lett 13:1367-71 (2003)  
Target
Name:
Protein farnesyltransferase subunit beta/geranylgeranyltransferase type-1 subunit alpha
Synonyms:
Protein Farnesyltransferase (PFT) | Protein farnesyltransferase
Type:
Protein Complex
Mol. Mass.:
Description:
Purified bovine brain FTase.
Components:
This complex has 2 components.
Component 1
Name:
Protein farnesyltransferase/geranylgeranyltransferase type-1 subunit alpha
Synonyms:
CAAX farnesyltransferase alpha subunit FNTA_BOVIN GGTase-I-alpha Protein Farnesyltransferase (PFT) Chain A Protein farnesyltransferase/geranylgeranyltransferase type I alpha subunit Type I protein geranyl-geranyltransferase alpha subunit
Type:
Enzyme
Mol. Mass.:
43827.38
Organism:
Bos taurus (bovine)
Description:
The enzyme was purified from a bovine brain homogenate by sequential ammonium sulfate fractionation and affinity chromatography.
Residue:
375
  
Component 2
Name:
Protein farnesyltransferase subunit beta
Synonyms:
CAAX farnesyltransferase subunit beta FNTB_BOVIN Protein farnesyltransferase Protein farnesyltransferase subunit beta Ras proteins prenyltransferase subunit beta
Type:
Enzyme Subunit
Mol. Mass.:
48758.49
Organism:
Bos taurus (bovine)
Description:
Protein farnesyltransferase subunit beta
Residue:
437
  
Inhibitor
Name:
BDBM50126335
Synonyms:
6-[(R)-Amino-(4-chloro-phenyl)-(3-methyl-3H-imidazol-4-yl)-methyl]-4-(3-chloro-phenyl)-1-methyl-1H-quinolin-2-one 6-[(S)-AMINO(4-CHLOROPHENYL)(1-METHYL-1H-IMIDAZOL-5-YL)METHYL]-4-(3-CHLOROPHENYL)-1-METHYLQUINOLIN-2(1H)-ONE 6-[Amino-(4-chloro-phenyl)-(3-methyl-3H-imidazol-4-yl)-methyl]-4-(3-chloro-phenyl)-1-methyl-1H-quinolin-2-one R-11577 Tipifarnib
Type:
Small organic molecule
Emp. Form.:
C27H22Cl2N4O
Mol. Mass.:
489.396
SMILES:
Cn1ccnc1C(N)(c1ccc(Cl)cc1)c1ccc2n(C)c(=O)cc(-c3cccc(Cl)c3)c2c1
: