Target
Sodium-dependent dopamine transporter
Ligand
BDBM22199
Substrate
Meas. Tech.
ChEBML_62473
Ki
0.900000±n/a nM
Citation
 Lewis, DZhang, YPrisinzano, TDersch, CMRothman, RBJacobson, AERice, KC Further exploration of 1-[2-[Bis-(4-fluorophenyl)methoxy]ethyl]piperazine (GBR 12909): role of N-aromatic, N-heteroaromatic, and 3-oxygenated N-phenylpropyl substituents on affinity for the dopamine and serotonin transporter. Bioorg Med Chem Lett 13:1385-9 (2003)  
Target
Name:
Sodium-dependent dopamine transporter
Synonyms:
DA transporter SC6A3_RAT Sodium-dependent dopamine transporter | Sodium-dependent dopamine transporter (DAT)
Type:
Multi-pass membrane protein
Mol. Mass.:
68749.45
Organism:
Rattus norvegicus (rat)
Description:
P23977
Residue:
619
  
Inhibitor
Name:
BDBM22199
Synonyms:
1-{2-[bis(4-fluorophenyl)methoxy]ethyl}-4-[(2E)-3-phenylprop-2-en-1-yl]piperazine CHEMBL286991 GBR-13,069
Type:
Small organic molecule
Emp. Form.:
C28H30F2N2O
Mol. Mass.:
448.5474
SMILES:
Fc1ccc(cc1)C(OCCN1CCN(C\C=C\c2ccccc2)CC1)c1ccc(F)cc1
: