Target
Sodium-dependent dopamine transporter
Ligand
BDBM50126386
Substrate
Meas. Tech.
ChEBML_62473
Ki
1.3±n/a nM
Citation
 Lewis, DZhang, YPrisinzano, TDersch, CMRothman, RBJacobson, AERice, KC Further exploration of 1-[2-[Bis-(4-fluorophenyl)methoxy]ethyl]piperazine (GBR 12909): role of N-aromatic, N-heteroaromatic, and 3-oxygenated N-phenylpropyl substituents on affinity for the dopamine and serotonin transporter. Bioorg Med Chem Lett 13:1385-9 (2003)  
Target
Name:
Sodium-dependent dopamine transporter
Synonyms:
DA transporter SC6A3_RAT Sodium-dependent dopamine transporter | Sodium-dependent dopamine transporter (DAT)
Type:
Multi-pass membrane protein
Mol. Mass.:
68749.45
Organism:
Rattus norvegicus (rat)
Description:
P23977
Residue:
619
  
Inhibitor
Name:
BDBM50126386
Synonyms:
(1R,2S)-2-((4-(2-(bis(4-fluorophenyl)methoxy)ethyl)piperazin-1-yl)methyl)-1,2,3,4-tetrahydronaphthalen-1-ol CHEMBL28660
Type:
Small organic molecule
Emp. Form.:
C30H34F2N2O2
Mol. Mass.:
492.6
SMILES:
O[C@@H]1[C@H](CN2CCN(CCOC(c3ccc(F)cc3)c3ccc(F)cc3)CC2)CCc2ccccc12
: