Target
5-hydroxytryptamine receptor 1A
Ligand
BDBM50318633
Substrate
Meas. Tech.
ChEMBL_2080337 (CHEMBL4736128)
Ki
2370±n/a nM
Citation
 Vanda, DCanale, VChaumont-Dubel, SKurczab, RSata?a, GKoczurkiewicz-Adamczyk, PKrawczyk, MPietru?, WBlicharz, KP?kala, EBojarski, AJPopik, PMarin, PSoural, MZajdel, P Imidazopyridine-Based 5-HT J Med Chem 64:1180-1196 (2021)  
Target
Name:
5-hydroxytryptamine receptor 1A
Synonyms:
5-HT-1A 5-hydroxytryptamine receptor 1A (5-HT-1A) ADRB2RL1 Dopamine D2 receptor and serotonin 1a receptor HTR1A | Serotonin receptor 1A
Type:
Mol. Mass.:
46122.49
Organism:
Homo sapiens (Human)
Description:
Residue:
422
  
Inhibitor
Name:
BDBM50318633
Synonyms:
3-benzenesulfonyl-8-piperazin-1-ylquinoline SB-742457
Type:
Small organic molecule
Emp. Form.:
C19H19N3O2S
Mol. Mass.:
353.438
SMILES:
O=S(=O)(c1ccccc1)c1cnc2c(cccc2c1)N1CCNCC1
: