Target
Sphingosine kinase 2
Ligand
BDBM50562760
Substrate
Meas. Tech.
ChEMBL_2080384 (CHEMBL4736175)
Ki
0.090000±n/a nM
Citation
 Congdon, MFritzemeier, RGKharel, YBrown, AMSerbulea, VBevan, DRLynch, KRSantos, WL Probing the substitution pattern of indole-based scaffold reveals potent and selective sphingosine kinase 2 inhibitors. Eur J Med Chem 212:0 (2021)  
Target
Name:
Sphingosine kinase 2
Synonyms:
SK 2 SPHK2 SPK 2 Sphingosine kinase types 2 (SphK2)
Type:
Protein
Mol. Mass.:
69221.44
Organism:
Homo sapiens (Human)
Description:
Q9NRA0
Residue:
654
  
Inhibitor
Name:
BDBM50562760
Synonyms:
CHEMBL4750447
Type:
Small organic molecule
Emp. Form.:
C24H35ClN6O
Mol. Mass.:
459.027
SMILES:
Cl.CCCCCCCCCn1ccc2cc(ccc12)-c1noc(n1)[C@@H]1CCCN1C(N)=N
: