Target
Sphingosine kinase 2
Ligand
BDBM50177006
Substrate
Meas. Tech.
ChEMBL_2080384 (CHEMBL4736175)
Ki
1.0±n/a nM
Citation
 Congdon, MFritzemeier, RGKharel, YBrown, AMSerbulea, VBevan, DRLynch, KRSantos, WL Probing the substitution pattern of indole-based scaffold reveals potent and selective sphingosine kinase 2 inhibitors. Eur J Med Chem 212:0 (2021)  
Target
Name:
Sphingosine kinase 2
Synonyms:
SK 2 SPHK2 SPK 2 Sphingosine kinase types 2 (SphK2)
Type:
Protein
Mol. Mass.:
69221.44
Organism:
Homo sapiens (Human)
Description:
Q9NRA0
Residue:
654
  
Inhibitor
Name:
BDBM50177006
Synonyms:
CHEMBL3814849
Type:
Small organic molecule
Emp. Form.:
C25H23ClF3N5O2
Mol. Mass.:
517.931
SMILES:
Cl.NC(=N)N1CCC[C@H]1c1nc(no1)-c1ccc2cc(OCc3ccc(cc3)C(F)(F)F)ccc2c1
: