Target
Sodium-dependent dopamine transporter
Ligand
BDBM50126820
Substrate
Meas. Tech.
ChEMBL_62334 (CHEMBL674427)
Ki
1.2±n/a nM
Citation
 Greiner, EPrisinzano, TJohnson II, EMDersch, CMMarcus, JPartilla, JSRothman, RBJacobson, AERice, KC Structure-activity relationship studies of highly selective inhibitors of the dopamine transporter: N-benzylpiperidine analogues of 1-[2-[bis(4-fluorophenyl)methoxy]ethyl]-4-(3-phenylpropyl)piperazine. J Med Chem 46:1465-9 (2003)  
Target
Name:
Sodium-dependent dopamine transporter
Synonyms:
DA transporter SC6A3_RAT Sodium-dependent dopamine transporter | Sodium-dependent dopamine transporter (DAT)
Type:
Multi-pass membrane protein
Mol. Mass.:
68749.45
Organism:
Rattus norvegicus (rat)
Description:
P23977
Residue:
619
  
Inhibitor
Name:
BDBM50126820
Synonyms:
1-(4-nitrobenzyl)-4-(2-(bis(4-fluorophenyl)methoxy)ethyl)piperidine CHEMBL290799
Type:
Small organic molecule
Emp. Form.:
C27H28F2N2O3
Mol. Mass.:
466.5196
SMILES:
[O-][N+](=O)c1ccc(CN2CCC(CCOC(c3ccc(F)cc3)c3ccc(F)cc3)CC2)cc1
: