Target
Transitional endoplasmic reticulum ATPase
Ligand
BDBM50249208
Substrate
Meas. Tech.
ChEMBL_2080774 (CHEMBL4736565)
IC50
5700±n/a nM
Citation
 Zhang, GLi, SWang, FJones, ACGoldberg, AFGLin, BVirgil, SStoltz, BMDeshaies, RJChou, TF A covalent p97/VCP ATPase inhibitor can overcome resistance to CB-5083 and NMS-873 in colorectal cancer cells. Eur J Med Chem 213:0 (2021)  
Target
Name:
Transitional endoplasmic reticulum ATPase
Synonyms:
TERA_HUMAN VCP Valosin-containing protein
Type:
Enzyme
Mol. Mass.:
89300.63
Organism:
Homo sapiens (Human)
Description:
P55072
Residue:
806
  
Inhibitor
Name:
BDBM50249208
Synonyms:
2-methoxy-4-(2-nitrovinyl)phenyl benzoate | CHEMBL470717
Type:
Small organic molecule
Emp. Form.:
C16H13NO5
Mol. Mass.:
299.2781
SMILES:
COc1cc(\C=C\[N+]([O-])=O)ccc1OC(=O)c1ccccc1
: