Target
Glutathione S-transferase Mu 2
Ligand
BDBM50562990
Substrate
Meas. Tech.
ChEMBL_2081214 (CHEMBL4737005)
IC50
200±n/a nM
Citation
 Liu, QLiu, ZHua, WGou, S Discovery of 6-(7-Nitro-2,1,3-benzoxadiazol-4-ylthio)hexanol Derivatives as Glutathione Transferase Inhibitors with Favorable Selectivity and Tolerated Toxicity. J Med Chem 64:1701-1712 (2021)  
Target
Name:
Glutathione S-transferase Mu 2
Synonyms:
GST class-mu 2 GSTM2 GSTM2_HUMAN | Glutathione S-transferase Mu 2
Type:
PROTEIN
Mol. Mass.:
25743.85
Organism:
Homo sapiens (Human)
Description:
ChEMBL_1441153
Residue:
218
  
Inhibitor
Name:
BDBM50562990
Synonyms:
CHEMBL4797471
Type:
Small organic molecule
Emp. Form.:
C22H31N5O6S
Mol. Mass.:
493.576
SMILES:
[O-][N+](=O)c1ccc(SCCCCCCOC(=O)CCC(=O)NCCN2CCCC2)c2nonc12
: