Target
Neurotensin receptor type 2
Ligand
BDBM50563001
Substrate
Meas. Tech.
ChEMBL_2081372 (CHEMBL4737163)
Ki
4.6±n/a nM
Citation
 Chartier, MDesgagné, MSousbie, MCôté, JLongpré, JMMarsault, ESarret, P Design, Structural Optimization, and Characterization of the First Selective Macrocyclic Neurotensin Receptor Type 2 Non-opioid Analgesic. J Med Chem 64:2110-2124 (2021)  
Target
Name:
Neurotensin receptor type 2
Synonyms:
Levocabastine-sensitive neurotensin receptor NTR2 NTR2_HUMAN Neurotensin receptor Neurotensin receptor type 2
Type:
PROTEIN
Mol. Mass.:
45404.76
Organism:
Homo sapiens (Human)
Description:
ChEMBL_1281495
Residue:
410
  
Inhibitor
Name:
BDBM50563001
Synonyms:
CHEMBL4756326
Type:
Small organic molecule
Emp. Form.:
C76H119N21O20
Mol. Mass.:
1646.8868
SMILES:
CC[C@H](C)[C@H](NC(=O)[C@H](Cc1ccc(O)cc1)NC(=O)[C@@H]1CCCN1C(=O)[C@H](CCCNC(N)=N)NC(=O)[C@H](CCCNC(N)=N)NC(=O)[C@H](C)NC(=O)[C@H](CCCCN)NC(=O)[C@H](CC(N)=O)NC(=O)[C@H](CCC(O)=O)NC(=O)[C@H](Cc1ccc(O)cc1)NC(=O)[C@H](CC(C)C)NC(=O)[C@@H]1CCC(=O)N1)C(=O)N[C@@H](CC(C)C)C(O)=O
: