Target
Gastrin-releasing peptide receptor
Ligand
BDBM50127519
Substrate
Meas. Tech.
ChEMBL_70373 (CHEMBL680583)
EC50
84±n/a nM
Citation
 Weber, DBerger, CEickelmann, PAntel, JKessler, H Design of selective peptidomimetic agonists for the human orphan receptor BRS-3. J Med Chem 46:1918-30 (2003)  
Target
Name:
Gastrin-releasing peptide receptor
Synonyms:
Bombesin 2 GRP-preferring bombesin receptor GRPR_HUMAN Gastrin-releasing peptide receptor
Type:
Enzyme Catalytic Domain
Mol. Mass.:
43214.53
Organism:
Homo sapiens (Human)
Description:
Bombesin 2 GRPR 0::P30550
Residue:
384
  
Inhibitor
Name:
BDBM50127519
Synonyms:
CHEMBL262992 | [D-Tyr6-, Beta-Ala11, Phe13, Nle14] Bn (6-14)(Bombesin Analogue)
Type:
Small organic molecule
Emp. Form.:
C58H79N11O11
Mol. Mass.:
1106.315
SMILES:
CCCC[C@H](NC(=O)[C@H](Cc1ccccc1)NC(=O)[C@@H](NC(=O)CCNC(=O)[C@H](CC(C)C)NC(=O)[C@H](Cc1cnc[nH]1)NC(=O)[C@H](Cc1ccccc1)NC(=O)[C@@H]1CCCN1C(=O)[C@H](N)Cc1ccc(O)cc1)C(C)C)C(O)=O
: