Target
Gastrin-releasing peptide receptor
Ligand
BDBM50127535
Substrate
Meas. Tech.
ChEMBL_70373 (CHEMBL680583)
EC50
12200±n/a nM
Citation
 Weber, DBerger, CEickelmann, PAntel, JKessler, H Design of selective peptidomimetic agonists for the human orphan receptor BRS-3. J Med Chem 46:1918-30 (2003)  
Target
Name:
Gastrin-releasing peptide receptor
Synonyms:
Bombesin 2 GRP-preferring bombesin receptor GRPR_HUMAN Gastrin-releasing peptide receptor
Type:
Enzyme Catalytic Domain
Mol. Mass.:
43214.53
Organism:
Homo sapiens (Human)
Description:
Bombesin 2 GRPR 0::P30550
Residue:
384
  
Inhibitor
Name:
BDBM50127535
Synonyms:
2-[2-(4-Chloro-phenyl)-acetylamino]-pentanedioic acid 5-amide 1-{[2-(1H-indol-3-yl)-1-phenethylcarbamoyl-ethyl]-amide} | CHEMBL291764
Type:
Small organic molecule
Emp. Form.:
C32H34ClN5O4
Mol. Mass.:
588.096
SMILES:
NC(=O)CCC(NC(=O)Cc1ccc(Cl)cc1)C(=O)NC(Cc1c[nH]c2ccccc12)C(=O)NCCc1ccccc1
: