Target
Nischarin
Ligand
BDBM50127572
Substrate
Meas. Tech.
ChEMBL_220592 (CHEMBL841871)
Ki
17±n/a nM
Citation
 Touzeau, FArrault, AGuillaumet, GScalbert, EPfeiffer, BRettori, MCRenard, PMérour, JY Synthesis and biological evaluation of new 2-(4,5-dihydro-1H-imidazol-2-yl)-3,4-dihydro-2H-1,4-benzoxazine derivatives. J Med Chem 46:1962-79 (2003)  
Target
Name:
Nischarin
Synonyms:
IRAS Imidazoline receptor 1 (I1R) NISCH Nischarin
Type:
Enzyme
Mol. Mass.:
166571.31
Organism:
Homo sapiens (Human)
Description:
Q9Y2I1
Residue:
1504
  
Inhibitor
Name:
BDBM50127572
Synonyms:
2-(4,5-Dihydro-1H-imidazol-2-yl)-6-fluoro-4-methyl-3,4-dihydro-2H-benzo[1,4]oxazine | CHEMBL14242
Type:
Small organic molecule
Emp. Form.:
C12H14FN3O
Mol. Mass.:
235.2575
SMILES:
CN1CC(Oc2ccc(F)cc12)C1=NCCN1
: