Target
Histamine H3 receptor
Ligand
BDBM50127604
Substrate
Meas. Tech.
ChEMBL_86758 (CHEMBL693567)
Ki
2.5±n/a nM
Citation
 Kazuta, YHirano, KNatsume, KYamada, SKimura, RMatsumoto, SFuruichi, KMatsuda, AShuto, S Cyclopropane-based conformational restriction of histamine. (1S,2S)-2-(2-aminoethyl)-1-(1H-imidazol-4-yl)cyclopropane, a highly selective agonist for the histamine H3 receptor, having a cis-cyclopropane structure. J Med Chem 46:1980-8 (2003)  
Target
Name:
Histamine H3 receptor
Synonyms:
HH3R Hrh3
Type:
G Protein-Coupled Receptor (GPCR)
Mol. Mass.:
48607.98
Organism:
Rattus norvegicus (rat)
Description:
Residue:
445
  
Inhibitor
Name:
BDBM50127604
Synonyms:
C-[2-(1H-Imidazol-4-yl)-cyclopropyl]-methylamine | CHEMBL305135
Type:
Small organic molecule
Emp. Form.:
C7H11N3
Mol. Mass.:
137.1823
SMILES:
NC[C@@H]1C[C@@H]1c1cnc[nH]1
: