Target
Histamine H3 receptor
Ligand
BDBM50127608
Substrate
Meas. Tech.
ChEMBL_86758 (CHEMBL693567)
Ki
4.8±n/a nM
Citation
 Kazuta, YHirano, KNatsume, KYamada, SKimura, RMatsumoto, SFuruichi, KMatsuda, AShuto, S Cyclopropane-based conformational restriction of histamine. (1S,2S)-2-(2-aminoethyl)-1-(1H-imidazol-4-yl)cyclopropane, a highly selective agonist for the histamine H3 receptor, having a cis-cyclopropane structure. J Med Chem 46:1980-8 (2003)  
Target
Name:
Histamine H3 receptor
Synonyms:
HH3R Hrh3
Type:
G Protein-Coupled Receptor (GPCR)
Mol. Mass.:
48607.98
Organism:
Rattus norvegicus (rat)
Description:
Residue:
445
  
Inhibitor
Name:
BDBM50127608
Synonyms:
2-[2-(1H-Imidazol-4-yl)-cyclopropyl]-ethylamine | CHEMBL418470
Type:
Small organic molecule
Emp. Form.:
C8H13N3
Mol. Mass.:
151.2089
SMILES:
NCC[C@H]1C[C@H]1c1cnc[nH]1
: