Target
Plasminogen activator inhibitor 1
Ligand
BDBM50127735
Substrate
Meas. Tech.
ChEBML_155613
IC50
100±n/a nM
Citation
 De Nanteuil, GLila-Ambroise, CRupin, AVallez, MOVerbeuren, TJ New fibrinolytic agents: benzothiophene derivatives as inhibitors of the t-PA-PAI-1 complex formation. Bioorg Med Chem Lett 13:1705-8 (2003)  
Target
Name:
Plasminogen activator inhibitor 1
Synonyms:
Endothelial plasminogen activator inhibitor PAI-1 PAI1_HUMAN Plasminogen activator inhibitor 1 Plasminogen activator inhibitor-1 SERPINE1
Type:
Enzyme
Mol. Mass.:
45064.00
Organism:
Homo sapiens (Human)
Description:
P05121
Residue:
402
  
Inhibitor
Name:
BDBM50127735
Synonyms:
(E)-3-[3-(4-Chloro-phenoxy)-5,6-bis-(4-phenoxy-benzyloxy)-benzo[b]thiophen-2-yl]-2-pyridin-4-yl-acrylic acid | CHEMBL47330
Type:
Small organic molecule
Emp. Form.:
C48H34ClNO7S
Mol. Mass.:
804.304
SMILES:
OC(=O)C(=C\c1sc2cc(OCc3ccc(Oc4ccccc4)cc3)c(OCc3ccc(Oc4ccccc4)cc3)cc2c1Oc1ccc(Cl)cc1)\c1ccncc1
: