Target
Sodium channel protein type 5 subunit alpha
Ligand
BDBM16173
Substrate
Meas. Tech.
ChEMBL_2083684 (CHEMBL4739475)
IC50
>30000±n/a nM
Citation
 Buckley, BJAboelela, AMajed, HBujaroski, RSWhite, KLPowell, AKWang, WKatneni, KSaunders, JShackleford, DMCharman, SACook, GMKelso, MJRanson, M Systematic evaluation of structure-property relationships and pharmacokinetics in 6-(hetero)aryl-substituted matched pair analogs of amiloride and 5-(N,N-hexamethylene)amiloride. Bioorg Med Chem 37:0 (2021)  
Target
Name:
Sodium channel protein type 5 subunit alpha
Synonyms:
HH1 SCN5A_HUMAN Sodium channel protein type 5 subunit alpha/beta-1/beta-2 Voltage-gated sodium channel subunit alpha Nav1.5
Type:
Enzyme
Mol. Mass.:
226908.60
Organism:
Homo sapiens (Human)
Description:
Q14524
Residue:
2016
  
Inhibitor
Name:
BDBM16173
Synonyms:
3,5-diamino-6-chloro-N-(diaminomethylene)pyrazinamide;hydrochloride Amiloride CHEMBL945
Type:
Small organic molecule
Emp. Form.:
C6H8ClN7O
Mol. Mass.:
229.627
SMILES:
NC(=N)NC(=O)c1nc(Cl)c(N)nc1N
: