Target
Phosphatidylinositol 4,5-bisphosphate 3-kinase catalytic subunit delta isoform
Ligand
BDBM198023
Substrate
Meas. Tech.
ChEMBL_2084624 (CHEMBL4765887)
EC50
7.0±n/a nM
Citation
 Patel, LChandrasekhar, JEvarts, JForseth, KHaran, ACIp, CKashishian, AKim, MKoditek, DKoppenol, SLad, LLepist, EIMcGrath, MEPerreault, SPuri, KDVillaseņor, AGSomoza, JRSteiner, BHTherrien, JTreiberg, JPhillips, G Discovery of Orally Efficacious Phosphoinositide 3-Kinase ? Inhibitors with Improved Metabolic Stability. J Med Chem 59:9228-9242 (2016)  
Target
Name:
Phosphatidylinositol 4,5-bisphosphate 3-kinase catalytic subunit delta isoform
Synonyms:
PI3-kinase p110 subunit delta PI3-kinase subunit p110-delta PIK3CD Phosphatidylinositol 4,5-biphosphate 3-kinase catalytic subunit delta (PIK3CD) Phosphatidylinositol 4,5-bisphosphate 3-kinase 110 kDa catalytic subunit delta (PI3K delta) Phosphatidylinositol 4,5-bisphosphate 3-kinase catalytic subunit delta (PI3Kdelta) Phosphatidylinositol 4,5-bisphosphate 3-kinase catalytic subunit delta isoform (PI3K delta) Phosphatidylinositol 4,5-bisphosphate 3-kinase catalytic subunit delta isoform (PI3K-delta) Phosphatidylinositol 4,5-bisphosphate 3-kinase catalytic subunit delta isoform (PI3Kdelta)
Type:
Enzyme Subunit
Mol. Mass.:
119489.41
Organism:
Homo sapiens (Human)
Description:
O00329
Residue:
1044
  
Inhibitor
Name:
BDBM198023
Synonyms:
US9221795, 19
Type:
Small organic molecule
Emp. Form.:
C23H20ClN9O
Mol. Mass.:
473.918
SMILES:
C[C@H](Nc1nc(N)nc(N)c1C#N)c1nc2cccc(Cl)c2c(=O)n1-c1cncc(c1)C1CC1
: