Target
Phosphatidylinositol 4,5-bisphosphate 3-kinase catalytic subunit delta isoform
Ligand
BDBM198031
Substrate
Meas. Tech.
ChEMBL_2084624 (CHEMBL4765887)
EC50
1.000000±n/a nM
Citation
 Patel, LChandrasekhar, JEvarts, JForseth, KHaran, ACIp, CKashishian, AKim, MKoditek, DKoppenol, SLad, LLepist, EIMcGrath, MEPerreault, SPuri, KDVillaseņor, AGSomoza, JRSteiner, BHTherrien, JTreiberg, JPhillips, G Discovery of Orally Efficacious Phosphoinositide 3-Kinase ? Inhibitors with Improved Metabolic Stability. J Med Chem 59:9228-9242 (2016)  
Target
Name:
Phosphatidylinositol 4,5-bisphosphate 3-kinase catalytic subunit delta isoform
Synonyms:
PI3-kinase p110 subunit delta PI3-kinase subunit p110-delta PIK3CD Phosphatidylinositol 4,5-biphosphate 3-kinase catalytic subunit delta (PIK3CD) Phosphatidylinositol 4,5-bisphosphate 3-kinase 110 kDa catalytic subunit delta (PI3K delta) Phosphatidylinositol 4,5-bisphosphate 3-kinase catalytic subunit delta (PI3Kdelta) Phosphatidylinositol 4,5-bisphosphate 3-kinase catalytic subunit delta isoform (PI3K delta) Phosphatidylinositol 4,5-bisphosphate 3-kinase catalytic subunit delta isoform (PI3K-delta) Phosphatidylinositol 4,5-bisphosphate 3-kinase catalytic subunit delta isoform (PI3Kdelta)
Type:
Enzyme Subunit
Mol. Mass.:
119489.41
Organism:
Homo sapiens (Human)
Description:
O00329
Residue:
1044
  
Inhibitor
Name:
BDBM198031
Synonyms:
US9221795, 27
Type:
Small organic molecule
Emp. Form.:
C22H17ClFN9O
Mol. Mass.:
477.881
SMILES:
Nc1nc(N)c(C#N)c(N[C@@H](C2CC2)c2nc3c(F)ccc(Cl)c3c(=O)n2-c2cccnc2)n1
: