Target
Coagulation factor X
Ligand
BDBM50127881
Substrate
Meas. Tech.
ChEBML_48990
Ki
>30000±n/a nM
Citation
 Lam, PYAdams, JJClark, CGCalhoun, WJLuettgen, JMKnabb, RMWexler, RR Discovery of 3-amino-4-chlorophenyl P1 as a novel and potent benzamidine mimic via solid-phase synthesis of an isoxazoline library. Bioorg Med Chem Lett 13:1795-9 (2003)  
Target
Name:
Coagulation factor X
Synonyms:
Activated coagulation factor X (FXa) Coagulation factor X precursor F10 Factor X heavy chain Factor Xa Stuart-Prower factor
Type:
Enzyme
Mol. Mass.:
54726.60
Organism:
Homo sapiens (Human)
Description:
Residue:
488
  
Inhibitor
Name:
BDBM50127881
Synonyms:
3-(4-Hydroxy-3,5-diiodo-phenyl)-4,5-dihydro-isoxazole-5-carboxylic acid (2'-sulfamoyl-biphenyl-4-yl)-amide | CHEMBL300627
Type:
Small organic molecule
Emp. Form.:
C22H17I2N3O5S
Mol. Mass.:
689.261
SMILES:
NS(=O)(=O)c1ccccc1-c1ccc(NC(=O)C2CC(=NO2)c2cc(I)c(O)c(I)c2)cc1
: