Target
Coagulation factor X
Ligand
BDBM50127915
Substrate
Meas. Tech.
ChEMBL_48988 (CHEMBL662871)
Ki
130±n/a nM
Citation
 Lam, PYAdams, JJClark, CGCalhoun, WJLuettgen, JMKnabb, RMWexler, RR Discovery of 3-amino-4-chlorophenyl P1 as a novel and potent benzamidine mimic via solid-phase synthesis of an isoxazoline library. Bioorg Med Chem Lett 13:1795-9 (2003)  
Target
Name:
Coagulation factor X
Synonyms:
Activated coagulation factor X (FXa) Coagulation factor X precursor F10 Factor X heavy chain Factor Xa Stuart-Prower factor
Type:
Enzyme
Mol. Mass.:
54726.60
Organism:
Homo sapiens (Human)
Description:
Residue:
488
  
Inhibitor
Name:
BDBM50127915
Synonyms:
3-(3-Amino-4-chloro-phenyl)-4,5-dihydro-isoxazole-5-carboxylic acid (2'-sulfamoyl-biphenyl-4-yl)-amide | CHEMBL51413
Type:
Small organic molecule
Emp. Form.:
C22H19ClN4O4S
Mol. Mass.:
470.929
SMILES:
Nc1cc(ccc1Cl)C1=NOC(C1)C(=O)Nc1ccc(cc1)-c1ccccc1S(N)(=O)=O
: