Target
Coagulation factor X
Ligand
BDBM50127911
Substrate
Meas. Tech.
ChEBML_48990
Ki
20000±n/a nM
Citation
 Lam, PYAdams, JJClark, CGCalhoun, WJLuettgen, JMKnabb, RMWexler, RR Discovery of 3-amino-4-chlorophenyl P1 as a novel and potent benzamidine mimic via solid-phase synthesis of an isoxazoline library. Bioorg Med Chem Lett 13:1795-9 (2003)  
Target
Name:
Coagulation factor X
Synonyms:
Activated coagulation factor X (FXa) Coagulation factor X precursor F10 Factor X heavy chain Factor Xa Stuart-Prower factor
Type:
Enzyme
Mol. Mass.:
54726.60
Organism:
Homo sapiens (Human)
Description:
Residue:
488
  
Inhibitor
Name:
BDBM50127911
Synonyms:
3-Naphthalen-2-yl-4,5-dihydro-isoxazole-5-carboxylic acid (2'-sulfamoyl-biphenyl-4-yl)-amide | CHEMBL53178
Type:
Small organic molecule
Emp. Form.:
C26H21N3O4S
Mol. Mass.:
471.528
SMILES:
NS(=O)(=O)c1ccccc1-c1ccc(NC(=O)C2CC(=NO2)c2ccc3ccccc3c2)cc1
: