Target
Peroxisome proliferator-activated receptor delta
Ligand
BDBM28681
Substrate
Meas. Tech.
ChEBML_154546
IC50
>50000±n/a nM
Citation
 Koyama, HBoueres, JKHan, WMetzger, EJBergman, JPGratale, DFMiller, DJTolman, RLMacNaul, KLBerger, JPDoebber, TWLeung, KMoller, DEHeck, JVSahoo, SP 5-Aryl thiazolidine-2,4-diones as selective PPARgamma agonists. Bioorg Med Chem Lett 13:1801-4 (2003)  
Target
Name:
Peroxisome proliferator-activated receptor delta
Synonyms:
NR1C2 NUCI Nuclear receptor subfamily 1 group C member 2 PPAR-beta PPARD Peroxisome proliferator-activated receptor Peroxisome proliferator-activated receptor delta
Type:
Enzyme
Mol. Mass.:
49910.45
Organism:
Homo sapiens (Human)
Description:
Q03181
Residue:
441
  
Inhibitor
Name:
BDBM28681
Synonyms:
5-[(4-{2-[methyl(pyridin-2-yl)amino]ethoxy}phenyl)methyl]-1,3-thiazolidine-2,4-dione BRL 49653 CHEMBL121 [3H]rosiglitazone rosiglitazone
Type:
radiolabeled ligand
Emp. Form.:
C18H19N3O3S
Mol. Mass.:
357.427
SMILES:
CN(CCOc1ccc(Cc2sc(=O)[nH]c2O)cc1)c1ccccn1
: