Target
Sodium channel protein type 3 subunit alpha
Ligand
BDBM50563816
Substrate
Meas. Tech.
ChEMBL_2084730 (CHEMBL4765993)
IC50
3500±n/a nM
Citation
 Zablocki, JAElzein, ELi, XKoltun, DOParkhill, EQKobayashi, TMartinez, RCorkey, BJiang, HPerry, TKalla, RNotte, GTSaunders, OGraupe, MLu, YVenkataramani, CGuerrero, JPerry, JOsier, MStrickley, RLiu, GWang, WQHu, LLi, XJEl-Bizri, NHirakawa, RKahlig, KXie, CLi, CHDhalla, AKRajamani, SMollova, NSoohoo, DLepist, EIMurray, BRhodes, GBelardinelli, LDesai, MC Discovery of Dihydrobenzoxazepinone (GS-6615) Late Sodium Current Inhibitor (Late I J Med Chem 59:9005-9017 (2016)  
Target
Name:
Sodium channel protein type 3 subunit alpha
Synonyms:
KIAA1356 NAC3 SCN3A_HUMAN Sodium channel alpha subunits; brain (Types I, II, III) Voltage-gated sodium channel subunit alpha Nav1.3 (Nav1.3)
Type:
Protein
Mol. Mass.:
226276.42
Organism:
Homo sapiens (Human)
Description:
Q9NY46
Residue:
2000
  
Inhibitor
Name:
BDBM50563816
Synonyms:
Eleclazine | GS-6615
Type:
Small organic molecule
Emp. Form.:
C21H16F3N3O3
Mol. Mass.:
415.3652
SMILES:
FC(F)(F)Oc1ccc(cc1)-c1ccc2OCCN(Cc3ncccn3)C(=O)c2c1
: