Target
Prolyl hydroxylase EGLN2
Ligand
BDBM50563889
Substrate
Meas. Tech.
ChEMBL_2085190 (CHEMBL4766453)
IC50
1.000000±n/a nM
Citation
 Debenham, JSMadsen-Duggan, CClements, MJWalsh, TFKuethe, JTReibarkh, MSalowe, SPSonatore, LMHajdu, RMilligan, JAVisco, DMZhou, DLingham, RBStickens, DDeMartino, JATong, XWolff, MPang, JMiller, RRSherer, ECHale, JJ Discovery of N-[Bis(4-methoxyphenyl)methyl]-4-hydroxy-2-(pyridazin-3-yl)pyrimidine-5-carboxamide (MK-8617), an Orally Active Pan-Inhibitor of Hypoxia-Inducible Factor Prolyl Hydroxylase 1-3 (HIF PHD1-3) for the Treatment of Anemia. J Med Chem 59:11039-11049 (2016)  
Target
Name:
Prolyl hydroxylase EGLN2
Synonyms:
EGLN2 EIT6 Estrogen-induced tag 6 HIF-PH1 HPH-3 PHD1 Prolyl hydroxylase domain-containing protein 1 (PHD1)
Type:
Protein
Mol. Mass.:
43657.01
Organism:
Homo sapiens (Human)
Description:
Q96KS0
Residue:
407
  
Inhibitor
Name:
BDBM50563889
Synonyms:
CHEMBL4783524
Type:
Small organic molecule
Emp. Form.:
C24H21N5O4
Mol. Mass.:
443.4546
SMILES:
COc1ccc(cc1)C(NC(=O)c1cnc(nc1O)-c1cccnn1)c1ccc(OC)cc1
: