Target
Ephrin type-A receptor 7
Ligand
BDBM50563891
Substrate
Meas. Tech.
ChEMBL_2085740 (CHEMBL4767003)
IC50
199±n/a nM
Citation
 Yang, JChen, KZhang, GYang, QYLi, YSHuang, SZWang, YLYang, WJiang, XJYan, HXZhu, JQXiang, RLuo, YFLi, WMWei, YQLi, LLYang, SY Structural optimization and structure-activity relationship studies of N-phenyl-7,8-dihydro-6H-pyrimido[5,4-b][1,4]oxazin-4-amine derivatives as a new class of inhibitors of RET and its drug resistance mutants. Eur J Med Chem 143:1148-1164 (2018)  
Target
Name:
Ephrin type-A receptor 7
Synonyms:
2.7.10.1 EHK3 EPH homology kinase 3 EPHA7 Ephrin receptor Tyrosine Kinase EPHA6 | Tyrosine Kinase EPHA7
Type:
Mol. Mass.:
112085.32
Organism:
Homo sapiens (Human)
Description:
Residue:
998
  
Inhibitor
Name:
BDBM50563891
Synonyms:
CHEMBL4793380
Type:
Small organic molecule
Emp. Form.:
C21H25N7O3
Mol. Mass.:
423.4683
SMILES:
CC(C)(C)c1cc(NC(=O)Nc2ccc(Nc3ncnc4NCCCOc34)cc2)no1
: