Target
Squalene--hopene cyclase
Ligand
BDBM50128066
Substrate
Meas. Tech.
ChEMBL_201950 (CHEMBL809137)
IC50
406.0±n/a nM
Citation
 Lenhart, AReinert, DJAebi, JDDehmlow, HMorand, OHSchulz, GE Binding structures and potencies of oxidosqualene cyclase inhibitors with the homologous squalene-hopene cyclase. J Med Chem 46:2083-92 (2003)  
Target
Name:
Squalene--hopene cyclase
Synonyms:
SQHC_ALIAD Squalene-hopene cyclase | shc
Type:
PROTEIN
Mol. Mass.:
71559.28
Organism:
Alicyclobacillus acidocaldarius
Description:
ChEMBL_201951
Residue:
631
  
Inhibitor
Name:
BDBM50128066
Synonyms:
CHEMBL66412 Methyl-[4-(4-piperidin-1-ylmethyl-phenyl)-cyclohexyl]-carbamic acid 4-chloro-phenyl ester
Type:
Small organic molecule
Emp. Form.:
C26H33ClN2O2
Mol. Mass.:
441.005
SMILES:
CN([C@H]1CC[C@@H](CC1)c1ccc(CN2CCCCC2)cc1)C(=O)Oc1ccc(Cl)cc1
: