Target
Carbonic anhydrase 2
Ligand
BDBM50564138
Substrate
Meas. Tech.
ChEMBL_2086702 (CHEMBL4767965)
Ki
5.1±n/a nM
Citation
 Petreni, ABonardi, ALomelino, COsman, SMALOthman, ZAEldehna, WMEl-Haggar, RMcKenna, RNocentini, ASupuran, CT Inclusion of a 5-fluorouracil moiety in nitrogenous bases derivatives as human carbonic anhydrase IX and XII inhibitors produced a targeted action against MDA-MB-231 and T47D breast cancer cells. Eur J Med Chem 190:0 (2020)  
Target
Name:
Carbonic anhydrase 2
Synonyms:
CA-II CAC Carbonate dehydratase II Carbonic anhydrase 2 (CA-II) Carbonic anhydrase C Carbonic anhydrase II (CA-II) Carbonic anhydrase II (hCA II) | Carbonic anhydrase isoenzyme II (hCA II)
Type:
Enzyme
Mol. Mass.:
29250.71
Organism:
Homo sapiens (Human)
Description:
P00918
Residue:
260
  
Inhibitor
Name:
BDBM50564138
Synonyms:
CHEMBL4792199
Type:
Small organic molecule
Emp. Form.:
C23H26FN5O5S
Mol. Mass.:
503.546
SMILES:
CN(C)c1ccc(CN(CCc2ccc(cc2)S(N)(=O)=O)C(=O)Cn2cc(F)c(=O)[nH]c2=O)cc1
: