Target
Tyrosine-protein phosphatase non-receptor type 5
Ligand
BDBM50564155
Substrate
Meas. Tech.
ChEMBL_2086932 (CHEMBL4768195)
Ki
2200±n/a nM
Citation
 Hou, XSun, JPGe, LLiang, XLi, KZhang, YFang, H Inhibition of striatal-enriched protein tyrosine phosphatase by targeting computationally revealed cryptic pockets. Eur J Med Chem 190:0 (2020)  
Target
Name:
Tyrosine-protein phosphatase non-receptor type 5
Synonyms:
PTN5_HUMAN Tyrosine-protein phosphatase non-receptor type 5 | Tyrosine-protein phosphatase non-receptor type 5 isoform a
Type:
Enzyme Catalytic Domain
Mol. Mass.:
63510.68
Organism:
Homo sapiens (Human)
Description:
gi_90652859
Residue:
565
  
Inhibitor
Name:
BDBM50564155
Synonyms:
CHEMBL4792956
Type:
Small organic molecule
Emp. Form.:
C22H14O5
Mol. Mass.:
358.3436
SMILES:
[#6]-c1cc(ccc1-c1ccc(\[#6]=[#6]-2\[#6](=O)-c3ccccc3-[#6]-2=O)o1)-[#6](-[#8])=O
: