Target
Inosine-5'-monophosphate dehydrogenase 2
Ligand
BDBM50112570
Substrate
Meas. Tech.
ChEBML_89803
IC50
>5000±n/a nM
Citation
 Iwanowicz, EJWatterson, SHGuo, JPitts, WJMurali Dhar, TGShen, ZChen, PGu, HHFleener, CARouleau, KACheney, DLTownsend, RMHollenbaugh, DL Inhibitors of inosine monophosphate dehydrogenase: SARs about the N-[3-Methoxy-4-(5-oxazolyl)phenyl moiety. Bioorg Med Chem Lett 13:2059-63 (2003)  
Target
Name:
Inosine-5'-monophosphate dehydrogenase 2
Synonyms:
IMDH2_HUMAN IMPD 2 IMPDH-II Inosine 5'-monophosphate dehydrogenase II (IMPDH II) Inosine-5 -monophosphate dehydrogenase 2 | Inosine-5'-monophosphate dehydrogenase (IMPDH)
Type:
Enzyme
Mol. Mass.:
55806.87
Organism:
Homo sapiens (Human)
Description:
Recombinant IMPDH2 expressed in E. coli.
Residue:
514
  
Inhibitor
Name:
BDBM50112570
Synonyms:
CHEMBL279957 | N-tert-Butyl-N'-[4-(4-methyl-oxazol-5-yl)-phenyl]-oxalamide
Type:
Small organic molecule
Emp. Form.:
C16H19N3O3
Mol. Mass.:
301.3404
SMILES:
Cc1ncoc1-c1ccc(NC(=O)C(=O)NC(C)(C)C)cc1
: