Target
Inosine-5'-monophosphate dehydrogenase 2
Ligand
BDBM50129119
Substrate
Meas. Tech.
ChEBML_89803
IC50
>5000±n/a nM
Citation
 Iwanowicz, EJWatterson, SHGuo, JPitts, WJMurali Dhar, TGShen, ZChen, PGu, HHFleener, CARouleau, KACheney, DLTownsend, RMHollenbaugh, DL Inhibitors of inosine monophosphate dehydrogenase: SARs about the N-[3-Methoxy-4-(5-oxazolyl)phenyl moiety. Bioorg Med Chem Lett 13:2059-63 (2003)  
Target
Name:
Inosine-5'-monophosphate dehydrogenase 2
Synonyms:
IMDH2_HUMAN IMPD 2 IMPDH-II Inosine 5'-monophosphate dehydrogenase II (IMPDH II) Inosine-5 -monophosphate dehydrogenase 2 | Inosine-5'-monophosphate dehydrogenase (IMPDH)
Type:
Enzyme
Mol. Mass.:
55806.87
Organism:
Homo sapiens (Human)
Description:
Recombinant IMPDH2 expressed in E. coli.
Residue:
514
  
Inhibitor
Name:
BDBM50129119
Synonyms:
CHEMBL64898 | [4-(4-Methyl-oxazol-5-yl)-phenyl]-(5-phenyl-oxazol-2-yl)-amine
Type:
Small organic molecule
Emp. Form.:
C19H15N3O2
Mol. Mass.:
317.3413
SMILES:
Cc1ncoc1-c1ccc(Nc2ncc(o2)-c2ccccc2)cc1
: