Target
Inosine-5'-monophosphate dehydrogenase 2
Ligand
BDBM50112558
Substrate
Meas. Tech.
ChEBML_89803
IC50
50±n/a nM
Citation
 Iwanowicz, EJWatterson, SHGuo, JPitts, WJMurali Dhar, TGShen, ZChen, PGu, HHFleener, CARouleau, KACheney, DLTownsend, RMHollenbaugh, DL Inhibitors of inosine monophosphate dehydrogenase: SARs about the N-[3-Methoxy-4-(5-oxazolyl)phenyl moiety. Bioorg Med Chem Lett 13:2059-63 (2003)  
Target
Name:
Inosine-5'-monophosphate dehydrogenase 2
Synonyms:
IMDH2_HUMAN IMPD 2 IMPDH-II Inosine 5'-monophosphate dehydrogenase II (IMPDH II) Inosine-5 -monophosphate dehydrogenase 2 | Inosine-5'-monophosphate dehydrogenase (IMPDH)
Type:
Enzyme
Mol. Mass.:
55806.87
Organism:
Homo sapiens (Human)
Description:
Recombinant IMPDH2 expressed in E. coli.
Residue:
514
  
Inhibitor
Name:
BDBM50112558
Synonyms:
CHEMBL24866 | N-(3-Bromo-4-oxazol-5-yl-phenyl)-N'-tert-butyl-oxalamide
Type:
Small organic molecule
Emp. Form.:
C15H16BrN3O3
Mol. Mass.:
366.21
SMILES:
CC(C)(C)NC(=O)C(=O)Nc1ccc(-c2cnco2)c(Br)c1
: