Target
Inosine-5'-monophosphate dehydrogenase 2
Ligand
BDBM50129100
Substrate
Meas. Tech.
ChEBML_89803
IC50
100±n/a nM
Citation
 Iwanowicz, EJWatterson, SHGuo, JPitts, WJMurali Dhar, TGShen, ZChen, PGu, HHFleener, CARouleau, KACheney, DLTownsend, RMHollenbaugh, DL Inhibitors of inosine monophosphate dehydrogenase: SARs about the N-[3-Methoxy-4-(5-oxazolyl)phenyl moiety. Bioorg Med Chem Lett 13:2059-63 (2003)  
Target
Name:
Inosine-5'-monophosphate dehydrogenase 2
Synonyms:
IMDH2_HUMAN IMPD 2 IMPDH-II Inosine 5'-monophosphate dehydrogenase II (IMPDH II) Inosine-5 -monophosphate dehydrogenase 2 | Inosine-5'-monophosphate dehydrogenase (IMPDH)
Type:
Enzyme
Mol. Mass.:
55806.87
Organism:
Homo sapiens (Human)
Description:
Recombinant IMPDH2 expressed in E. coli.
Residue:
514
  
Inhibitor
Name:
BDBM50129100
Synonyms:
2-Hydroxy-N-methyl-N-{2-[2-(3-methyl-4-oxazol-5-yl-phenylamino)-oxazol-5-yl]-phenyl}-acetamide | CHEMBL293640
Type:
Small organic molecule
Emp. Form.:
C22H20N4O4
Mol. Mass.:
404.4186
SMILES:
CN(C(=O)CO)c1ccccc1-c1cnc(Nc2ccc(-c3cnco3)c(C)c2)o1
: