Target
Inosine-5'-monophosphate dehydrogenase 2
Ligand
BDBM50129091
Substrate
Meas. Tech.
ChEBML_89803
IC50
45±n/a nM
Citation
 Iwanowicz, EJWatterson, SHGuo, JPitts, WJMurali Dhar, TGShen, ZChen, PGu, HHFleener, CARouleau, KACheney, DLTownsend, RMHollenbaugh, DL Inhibitors of inosine monophosphate dehydrogenase: SARs about the N-[3-Methoxy-4-(5-oxazolyl)phenyl moiety. Bioorg Med Chem Lett 13:2059-63 (2003)  
Target
Name:
Inosine-5'-monophosphate dehydrogenase 2
Synonyms:
IMDH2_HUMAN IMPD 2 IMPDH-II Inosine 5'-monophosphate dehydrogenase II (IMPDH II) Inosine-5 -monophosphate dehydrogenase 2 | Inosine-5'-monophosphate dehydrogenase (IMPDH)
Type:
Enzyme
Mol. Mass.:
55806.87
Organism:
Homo sapiens (Human)
Description:
Recombinant IMPDH2 expressed in E. coli.
Residue:
514
  
Inhibitor
Name:
BDBM50129091
Synonyms:
CHEMBL62496 | N-Methyl-N-{2-[2-(3-methyl-4-oxazol-5-yl-phenylamino)-oxazol-5-yl]-phenyl}-2-morpholin-4-yl-acetamide
Type:
Small organic molecule
Emp. Form.:
C26H27N5O4
Mol. Mass.:
473.5237
SMILES:
CN(C(=O)CN1CCOCC1)c1ccccc1-c1cnc(Nc2ccc(-c3cnco3)c(C)c2)o1
: