Target
Cholinesterase
Ligand
BDBM25524
Substrate
Meas. Tech.
ChEMBL_2089391 (CHEMBL4770654)
IC50
8580±n/a nM
Citation
 Zhou, BLi, HCui, ZLi, DGeng, HGao, JZhou, L Simple analogues of natural product chelerythrine: Discovery of a novel anticholinesterase 2-phenylisoquinolin-2-ium scaffold with excellent potency against acetylcholinesterase. Eur J Med Chem 200:0 (2020)  
Target
Name:
Cholinesterase
Synonyms:
Acylcholine acylhydrolase Butyrylcholine esterase (BChE) Butyrylcholinesterase (BuChE) CHLE_HUMAN Cholinesterases Pseudocholinesterase
Type:
Homotetramer
Mol. Mass.:
68422.27
Organism:
Homo sapiens (Human)
Description:
P06276
Residue:
602
  
Inhibitor
Name:
BDBM25524
Synonyms:
17,18-dimethoxy-21-methyl-5,7-dioxa-21-azapentacyclo[11.8.0.0^{2,10}.0^{4,8}.0^{14,19}]henicosa-1(13),2,4(8),9,11,14(19),15,17,20-nonaen-21-ium CHEMBL258893 Toddalin | chelerythrine
Type:
Small organic molecule
Emp. Form.:
C21H18NO4
Mol. Mass.:
348.3714
SMILES:
COc1ccc2c(c[n+](C)c3c4cc5OCOc5cc4ccc23)c1OC
: