Target
Muscarinic acetylcholine receptor M1
Ligand
BDBM50129387
Substrate
Meas. Tech.
ChEBML_138407
Ki
0.980000±n/a nM
Citation
 Ogino, YOhtake, NKobayashi, KKimura, TFujikawa, THasegawa, TNoguchi, KMase, T Muscarinic M(3) receptor antagonists with (2R)-2-[(1R)-3,3-difluorocyclopentyl]-2-hydroxyphenylacetamide Structures. Part 2. Bioorg Med Chem Lett 13:2167-72 (2003)  
Target
Name:
Muscarinic acetylcholine receptor M1
Synonyms:
ACM1_HUMAN Cholinergic receptor, muscarinic 1 | Cholinergic, muscarinic M1
Type:
Protein
Mol. Mass.:
51442.54
Organism:
Homo sapiens (Human)
Description:
P11229
Residue:
460
  
Inhibitor
Name:
BDBM50129387
Synonyms:
(R)-1-(4-Amino-piperidin-1-yl)-2-cyclopentyl-2-hydroxy-2-phenyl-ethanone | CHEMBL71431
Type:
Small organic molecule
Emp. Form.:
C18H26N2O2
Mol. Mass.:
302.4112
SMILES:
NC1CCN(CC1)C(=O)[C@@](O)(C1CCCC1)c1ccccc1
: