Target
Proteinase-activated receptor 1
Ligand
BDBM50129486
Substrate
Meas. Tech.
ChEBML_209261
IC50
35±n/a nM
Citation
 Zhang, HCWhite, KBMcComsey, DFAddo, MFAndrade-Gordon, PDerian, CKOksenberg, DMaryanoff, BE High-affinity thrombin receptor (PAR-1) ligands: a new generation of indole-based peptide mimetic antagonists with a basic amine at the C-terminus. Bioorg Med Chem Lett 13:2199-203 (2003)  
Target
Name:
Proteinase-activated receptor 1
Synonyms:
CF2R F2R PAR1 Proteinase activated receptor 1 TR Thrombin receptor/ Proteinase-activated receptor 1(Par-1)
Type:
Protein
Mol. Mass.:
47450.07
Organism:
Homo sapiens (Human)
Description:
P25116
Residue:
425
  
Inhibitor
Name:
BDBM50129486
Synonyms:
(S)-N-[1-((S)-2-Amino-ethylcarbamoyl)-2-thiophen-2-yl-ethyl]-2-{3-[1-(2,6-dichloro-benzyl)-3-pyrrolidin-1-ylmethyl-1H-indol-6-yl]-ureido}-3-(3,4-difluoro-phenyl)-propionamide | CHEMBL71411
Type:
Small organic molecule
Emp. Form.:
C39H41Cl2F2N7O3S
Mol. Mass.:
796.756
SMILES:
NCCNC(=O)[C@H](Cc1cccs1)NC(=O)[C@H](Cc1ccc(F)c(F)c1)NC(=O)Nc1ccc2c(CN3CCCC3)cn(Cc3c(Cl)cccc3Cl)c2c1
: