Target
D(2) dopamine receptor
Ligand
BDBM50565000
Substrate
Meas. Tech.
ChEMBL_2089913 (CHEMBL4771176)
Ki
688±n/a nM
Citation
 Nizi, MGDesantis, JNakatani, YMassari, SMazzarella, MAShetye, GSabatini, SBarreca, MLManfroni, GFelicetti, TRushton-Green, RHards, KLatacz, GSata?a, GBojarski, AJCecchetti, VKolá?, MHHandzlik, JCook, GMFranzblau, SGTabarrini, O Antitubercular polyhalogenated phenothiazines and phenoselenazine with reduced binding to CNS receptors. Eur J Med Chem 201:0 (2020)  
Target
Name:
D(2) dopamine receptor
Synonyms:
D(2) dopamine receptor DOPAMINE D2 Long DRD2 Dopamine D2 receptor Dopamine D2 receptor (D2R) Dopamine2-like | d2
Type:
Cell-surface receptors
Mol. Mass.:
50647.10
Organism:
Homo sapiens (Human)
Description:
P14416
Residue:
443
  
Inhibitor
Name:
BDBM50565000
Synonyms:
CHEMBL4791959
Type:
Small organic molecule
Emp. Form.:
C20H23Br2ClN2S
Mol. Mass.:
518.736
SMILES:
Cl.CN1CCCCC1CCN1c2ccc(Br)cc2Sc2cc(Br)ccc12
: