Target
5-hydroxytryptamine receptor 2A
Ligand
BDBM50565002
Substrate
Meas. Tech.
ChEMBL_2089914 (CHEMBL4771177)
Ki
1762±n/a nM
Citation
 Nizi, MGDesantis, JNakatani, YMassari, SMazzarella, MAShetye, GSabatini, SBarreca, MLManfroni, GFelicetti, TRushton-Green, RHards, KLatacz, GSata?a, GBojarski, AJCecchetti, VKolá?, MHHandzlik, JCook, GMFranzblau, SGTabarrini, O Antitubercular polyhalogenated phenothiazines and phenoselenazine with reduced binding to CNS receptors. Eur J Med Chem 201:0 (2020)  
Target
Name:
5-hydroxytryptamine receptor 2A
Synonyms:
5-HT-2 5-HT2A 5-hydroxytryptamine receptor 2A (5HT-2A) 5HT2A_HUMAN HTR2A | Serotonin receptor 2A
Type:
undefined
Mol. Mass.:
52607.65
Organism:
Homo sapiens (Human)
Description:
P28223
Residue:
471
  
Inhibitor
Name:
BDBM50565002
Synonyms:
CHEMBL4778666
Type:
Small organic molecule
Emp. Form.:
C20H23Br2ClN2Se
Mol. Mass.:
565.63
SMILES:
Cl.[#6]-[#7]-1-[#6]-[#6]-[#6]-[#6]-[#6]-1-[#6]-[#6]-[#7]-1-c2ccc(Br)cc2[Se;v2]c2cc(Br)ccc-12
: