Target
5-hydroxytryptamine receptor 6
Ligand
BDBM50565002
Substrate
Meas. Tech.
ChEMBL_2089915 (CHEMBL4771178)
Ki
222±n/a nM
Citation
 Nizi, MGDesantis, JNakatani, YMassari, SMazzarella, MAShetye, GSabatini, SBarreca, MLManfroni, GFelicetti, TRushton-Green, RHards, KLatacz, GSata?a, GBojarski, AJCecchetti, VKolá?, MHHandzlik, JCook, GMFranzblau, SGTabarrini, O Antitubercular polyhalogenated phenothiazines and phenoselenazine with reduced binding to CNS receptors. Eur J Med Chem 201:0 (2020)  
Target
Name:
5-hydroxytryptamine receptor 6
Synonyms:
5-HT-6 5-hydroxytryptamine receptor 6 (5-HT-6) 5-hydroxytryptamine receptor 6 (5HT6) HTR6 Serotonin 6 (5-HT6) receptor | Serotonin Receptor 6
Type:
G Protein-Coupled Receptor (GPCR)
Mol. Mass.:
46968.43
Organism:
Homo sapiens (Human)
Description:
P50406
Residue:
440
  
Inhibitor
Name:
BDBM50565002
Synonyms:
CHEMBL4778666
Type:
Small organic molecule
Emp. Form.:
C20H23Br2ClN2Se
Mol. Mass.:
565.63
SMILES:
Cl.[#6]-[#7]-1-[#6]-[#6]-[#6]-[#6]-[#6]-1-[#6]-[#6]-[#7]-1-c2ccc(Br)cc2[Se;v2]c2cc(Br)ccc-12
: