Target
5-hydroxytryptamine receptor 6
Ligand
BDBM50002338
Substrate
Meas. Tech.
ChEMBL_2089915 (CHEMBL4771178)
Ki
71±n/a nM
Citation
 Nizi, MGDesantis, JNakatani, YMassari, SMazzarella, MAShetye, GSabatini, SBarreca, MLManfroni, GFelicetti, TRushton-Green, RHards, KLatacz, GSata?a, GBojarski, AJCecchetti, VKolá?, MHHandzlik, JCook, GMFranzblau, SGTabarrini, O Antitubercular polyhalogenated phenothiazines and phenoselenazine with reduced binding to CNS receptors. Eur J Med Chem 201:0 (2020)  
Target
Name:
5-hydroxytryptamine receptor 6
Synonyms:
5-HT-6 5-hydroxytryptamine receptor 6 (5-HT-6) 5-hydroxytryptamine receptor 6 (5HT6) HTR6 Serotonin 6 (5-HT6) receptor | Serotonin Receptor 6
Type:
G Protein-Coupled Receptor (GPCR)
Mol. Mass.:
46968.43
Organism:
Homo sapiens (Human)
Description:
P50406
Residue:
440
  
Inhibitor
Name:
BDBM50002338
Synonyms:
(Thioridazine)10-[2-(1-Methyl-piperidin-2-yl)-ethyl]-2-methylsulfanyl-10H-phenothiazine 10-[2-(1-Methyl-piperidin-2-yl)-ethyl]-2-methylsulfanyl-10H-phenothiazine CHEMBL479 MELLARIL-S TP-21 | US9504692, Thioridazine
Type:
Small organic molecule
Emp. Form.:
C21H26N2S2
Mol. Mass.:
370.575
SMILES:
CSc1ccc2Sc3ccccc3N(CCC3CCCCN3C)c2c1
: