Target
M-phase inducer phosphatase 2
Ligand
BDBM50129575
Substrate
Meas. Tech.
ChEMBL_49034 (CHEMBL662073)
Ki
13000±n/a nM
Citation
 Sohn, JKiburz, BLi, ZDeng, LSafi, APirrung, MCRudolph, J Inhibition of Cdc25 phosphatases by indolyldihydroxyquinones. J Med Chem 46:2580-8 (2003)  
Target
Name:
M-phase inducer phosphatase 2
Synonyms:
CDC25B Dual specificity phosphatase (CDC25B) M-phase inducer phosphatase 2 (CDC25B) | MPIP2_HUMAN
Type:
Protein
Mol. Mass.:
64985.27
Organism:
Homo sapiens (Human)
Description:
Residue:
580
  
Inhibitor
Name:
BDBM50129575
Synonyms:
2,5-Dihydroxy-3-(1H-indol-3-yl)-[1,4]benzoquinone | CHEMBL312892
Type:
Small organic molecule
Emp. Form.:
C14H9NO4
Mol. Mass.:
255.2256
SMILES:
O=C1CC(=O)C(=O)C(c2c[nH]c3ccccc23)C1=O
: