Target
Eukaryotic translation initiation factor 4E
Ligand
BDBM50565476
Substrate
Meas. Tech.
ChEMBL_2092047 (CHEMBL4773310)
IC50
6.5±n/a nM
Citation
 Gallagher, EEMenon, AChmiel, AFDeprey, KKritzer, JAGarner, AL A cell-penetrant lactam-stapled peptide for targeting eIF4E protein-protein interactions. Eur J Med Chem 205:0 (2020)  
Target
Name:
Eukaryotic translation initiation factor 4E
Synonyms:
EIF4E EIF4F Eukaryotic translation initiation factor 4E (eIF4E) IF4E_HUMAN
Type:
Protein
Mol. Mass.:
25095.44
Organism:
Homo sapiens (Human)
Description:
P06730
Residue:
217
  
Inhibitor
Name:
BDBM50565476
Synonyms:
CHEMBL4780117
Type:
Small organic molecule
Emp. Form.:
C79H128N24O18S2
Mol. Mass.:
1766.142
SMILES:
CC[C@H](C)[C@H](NC(=O)[C@H](CCCNC(N)=N)NC(C)=O)C(=O)N[C@@H]([C@@H](C)CC)C(=O)N[C@@H](Cc1ccc(O)cc1)C(=O)N[C@@H](CC(O)=O)C(=O)N[C@@H](CCCNC(N)=N)C(=O)N[C@H]1CCC(=O)NCCCC[C@H](NC(=O)[C@H](CCSC)NC(=O)[C@H](CC(C)C)NC(=O)[C@H](Cc2ccccc2)NC1=O)C(=O)N[C@@H](CS)C(=O)N[C@@H](CCCNC(N)=N)C(N)=O
: