Target
Serine-protein kinase ATM
Ligand
BDBM50565800
Substrate
Meas. Tech.
ChEMBL_2093853 (CHEMBL4775116)
IC50
0.090000±n/a nM
Citation
 Myers, SHOrtega, JACavalli, A Synthetic Lethality through the Lens of Medicinal Chemistry. J Med Chem 63:14151-14183 (2020)  
Target
Name:
Serine-protein kinase ATM
Synonyms:
A-T mutated ATM_HUMAN | Ataxia telangiectasia mutated
Type:
Protein
Mol. Mass.:
350696.72
Organism:
Homo sapiens (Human)
Description:
Q13315
Residue:
3056
  
Inhibitor
Name:
BDBM50565800
Synonyms:
Azd-1390 | Azd1390
Type:
Small organic molecule
Emp. Form.:
C27H32FN5O2
Mol. Mass.:
477.5737
SMILES:
CC(C)n1c2c(cnc3cc(F)c(cc23)-c2ccc(OCCCN3CCCCC3)nc2)n(C)c1=O
: