Target
Cyclin-dependent kinase 12
Ligand
BDBM50528813
Substrate
Meas. Tech.
ChEMBL_2093887 (CHEMBL4775150)
IC50
158±n/a nM
Citation
 Myers, SHOrtega, JACavalli, A Synthetic Lethality through the Lens of Medicinal Chemistry. J Med Chem 63:14151-14183 (2020)  
Target
Name:
Cyclin-dependent kinase 12
Synonyms:
2.7.11.22 CDC2-related protein kinase 7 CDK12_HUMAN CRKRS Cell division cycle 2-related protein kinase 7 Cyclin-dependent kinase 12 hCDK12
Type:
PROTEIN
Mol. Mass.:
164218.64
Organism:
Homo sapiens
Description:
ChEMBL_117739
Residue:
1490
  
Inhibitor
Name:
BDBM50528813
Synonyms:
CHEMBL4163879
Type:
Small organic molecule
Emp. Form.:
C30H32ClN7O2
Mol. Mass.:
558.074
SMILES:
CN(C)C\C=C\C(=O)Nc1ccc(cc1)C(=O)N1CCC[C@H](C1)Nc1ncc(Cl)c(n1)-c1c[nH]c2ccccc12
: