Target
Melanocortin receptor 3
Ligand
BDBM50565828
Substrate
Meas. Tech.
ChEMBL_2093907 (CHEMBL4775170)
IC50
76±n/a nM
Citation
 Martin, CGimenez, LEWilliams, SYJing, YWu, YHollanders, CVan der Poorten, OGonzalez, SVan Holsbeeck, KPreviti, SLamouroux, AZhao, STourwé, DStevens, RCCone, RDBallet, S Structure-Based Design of Melanocortin 4 Receptor Ligands Based on the SHU-9119-hMC4R Cocrystal Structure?. J Med Chem 64:357-369 (2021)  
Target
Name:
Melanocortin receptor 3
Synonyms:
MC3-R MC3R_HUMAN Melanocortin receptor (M3 and M4)
Type:
Enzyme
Mol. Mass.:
36044.86
Organism:
Homo sapiens (Human)
Description:
P41968
Residue:
323
  
Inhibitor
Name:
BDBM50565828
Synonyms:
CHEMBL4798971
Type:
Small organic molecule
Emp. Form.:
C54H70FN15O9
Mol. Mass.:
1092.2271
SMILES:
CCCC[C@H](NC(C)=O)C(=O)N[C@H]1CC(=O)NCCCC[C@H](NC(=O)[C@H](Cc2c[nH]c3cc(F)ccc23)NC(=O)[C@H](CCCNC(N)=N)NC(=O)[C@@H](Cc2ccc3ccccc3c2)NC(=O)[C@H](Cc2cnc[nH]2)NC1=O)C(N)=O
: