Target
Beta-adrenergic receptor kinase 1
Ligand
BDBM22416
Substrate
Meas. Tech.
ChEMBL_2094567 (CHEMBL4775830)
IC50
780±n/a nM
Citation
 Rowlands, RAChen, QBouley, RAAvramova, LVTesmer, JJGWhite, AD Generation of Highly Selective, Potent, and Covalent G Protein-Coupled Receptor Kinase 5 Inhibitors. J Med Chem 64:566-585 (2021)  
Target
Name:
Beta-adrenergic receptor kinase 1
Synonyms:
ADRBK1 Beta-ARK-1 G-protein-coupled receptor kinase 2 | GRK2
Type:
PROTEIN
Mol. Mass.:
79654.58
Organism:
Bos taurus
Description:
ChEMBL_113511
Residue:
689
  
Inhibitor
Name:
BDBM22416
Synonyms:
(3S,4R)-3-[(1,3-benzodioxol-5-yloxy)methyl]-4-(4-fluorophenyl)piperidine CHEMBL490 US09969700, Paroxetine [3H]Paroxetine
Type:
radiolabeled ligand
Emp. Form.:
C19H20FNO3
Mol. Mass.:
329.3654
SMILES:
Fc1ccc(cc1)[C@@H]1CCNC[C@H]1COc1ccc2OCOc2c1
: