Target
Casein kinase II subunit alpha 3
Ligand
BDBM50335638
Substrate
Meas. Tech.
ChEMBL_2100538 (CHEMBL4808934)
IC50
1.5±n/a nM
Citation
 Wang, YLv, ZChen, FWang, XGou, S Discovery of 5-(3-Chlorophenylamino)benzo[ J Med Chem 64:5082-5098 (2021)  
Target
Name:
Casein kinase II subunit alpha 3
Synonyms:
2.7.11.1 CSK23_HUMAN CSNK2A3 Casein kinase II subunit alpha 3
Type:
PROTEIN
Mol. Mass.:
45229.76
Organism:
Homo sapiens
Description:
ChEMBL_116899
Residue:
391
  
Inhibitor
Name:
BDBM50335638
Synonyms:
5-(3-Chlorophenylamino)benzo[c][2,6]naphthyridine-8-carboxylic acid CHEMBL1230165 US9062043, Table 13, Compound 17 | US9062043, Table 20b, Compound 12
Type:
Small organic molecule
Emp. Form.:
C19H12ClN3O2
Mol. Mass.:
349.77
SMILES:
OC(=O)c1ccc2c(c1)nc(Nc1cccc(Cl)c1)c1ccncc21
: