Target
Probable G-protein coupled receptor 139
Ligand
BDBM263433
Substrate
Meas. Tech.
ChEMBL_2101648 (CHEMBL4810044)
Ki
1148±n/a nM
Citation
 Reichard, HASchiffer, HHMonenschein, HAtienza, JMCorbett, GSkaggs, AWCollia, DRRay, WJSerrats, JBliesath, JKaushal, NLam, BPAmador-Arjona, ARahbaek, LMcConn, DJMulligan, VJBrice, NGaskin, PLRCilia, JHitchcock, S Discovery of TAK-041: a Potent and Selective GPR139 Agonist Explored for the Treatment of Negative Symptoms Associated with Schizophrenia. J Med Chem 64:11527-11542 (2021)  
Target
Name:
Probable G-protein coupled receptor 139
Synonyms:
G(q)-coupled orphan receptor GPRg1 G-protein-coupled receptor PGR3 GPR139 GPRG1 Probable G-protein coupled receptor 139
Type:
PROTEIN
Mol. Mass.:
40700.34
Organism:
Homo sapiens (Human)
Description:
ChEMBL_109920
Residue:
353
  
Inhibitor
Name:
BDBM263433
Synonyms:
(s)-2-(4-oxobenzo[d][1,2,3]triazin-3(4h)-yl)-n-(1-o-tolylethyl)acetamide US11173161, EX 10 | US9556130, test 10
Type:
Small organic molecule
Emp. Form.:
C18H18N4O2
Mol. Mass.:
322.3611
SMILES:
C[C@H](NC(=O)Cn1nnc2ccccc2c1=O)c1ccccc1C
: