Target
Probable G-protein coupled receptor 139
Ligand
BDBM263471
Substrate
Meas. Tech.
ChEMBL_2101648 (CHEMBL4810044)
Ki
437±n/a nM
Citation
 Reichard, HASchiffer, HHMonenschein, HAtienza, JMCorbett, GSkaggs, AWCollia, DRRay, WJSerrats, JBliesath, JKaushal, NLam, BPAmador-Arjona, ARahbaek, LMcConn, DJMulligan, VJBrice, NGaskin, PLRCilia, JHitchcock, S Discovery of TAK-041: a Potent and Selective GPR139 Agonist Explored for the Treatment of Negative Symptoms Associated with Schizophrenia. J Med Chem 64:11527-11542 (2021)  
Target
Name:
Probable G-protein coupled receptor 139
Synonyms:
G(q)-coupled orphan receptor GPRg1 G-protein-coupled receptor PGR3 GPR139 GPRG1 Probable G-protein coupled receptor 139
Type:
PROTEIN
Mol. Mass.:
40700.34
Organism:
Homo sapiens (Human)
Description:
ChEMBL_109920
Residue:
353
  
Inhibitor
Name:
BDBM263471
Synonyms:
(s)-2-(7-methoxy-4-oxobenzo[d][1,2,3]triazin-3(4h)-yl)-n-(1-p-tolylethyl)acetamide US11173161, EX 36 | US9556130, test 36
Type:
Small organic molecule
Emp. Form.:
C19H20N4O3
Mol. Mass.:
352.3871
SMILES:
COc1ccc2c(c1)nnn(CC(=O)N[C@@H](C)c1ccc(C)cc1)c2=O
: